Revised L1B_P.Scene_finder() and L1B_P.L1B_object.get_spatial_reference_scene()

2 jobs for feature/get_L1B_tests_to_work in 8 minutes and 51 seconds (queued for 2 seconds)
Status Name Job ID Coverage
  Test
failed test_gms_preprocessing #3076

00:07:17

53.0%
failed test_styles #3077

00:01:34

 
Name Stage Failure
failed
test_styles Test There is an unknown failure, please try again
$ make lint
flake8 --max-line-length=120 gms_preprocessing tests > ./tests/linting/flake8.log
make: *** [lint] Error 1
Uploading artifacts...
tests/linting/flake8.log: found 1 matching files

WARNING: tests/linting/pycodestyle.log: no matching files
WARNING: tests/linting/pydocstyle.log: no matching files
Uploading artifacts to coordinator... ok
id=3077 responseStatus=201 Created token=-XtsBwfb
ERROR: Job failed: exit code 1
failed
test_gms_preprocessing Test There is an unknown failure, please try again
25 FAILED (35 tests passed)
make: *** [nosetests] Error 1
Uploading artifacts...
htmlcov/: found 45 matching files

WARNING: docs/_build/html/: no matching files
nosetests.html: found 1 matching files

nosetests.xml: found 1 matching files

Uploading artifacts to coordinator... ok
id=3076 responseStatus=201 Created token=krZx1MUn
ERROR: Job failed: exit code 1