Bugfixes.

3 jobs for feature/improve_metadata_handling in 1 minute and 10 seconds (queued for 1 second)
Status Job ID Name Coverage
  Test
failed #8075
test_geoarray

00:00:41

68.0%
failed #8076
test_styles

00:00:14

 
  Cleanup
passed #8077
cleanup_pypirc

00:00:14

 
Name Stage Failure
failed
test_styles Test
    raise failed_to_load
flake8.exceptions.FailedToLoadPlugin: Flake8 failed to load plugin "pycodestyle.break_around_binary_operator" due to module 'pycodestyle' has no attribute 'break_around_binary_operator'.
make: *** [lint] Error 1
Uploading artifacts...
tests/linting/flake8.log: found 1 matching files
WARNING: tests/linting/pycodestyle.log: no matching files
WARNING: tests/linting/pydocstyle.log: no matching files
Uploading artifacts to coordinator... ok
id=8076 responseStatus=201 Created token=6Ufbwytz
ERROR: Job failed: exit code 1
failed
test_geoarray Test
1 FAILED (21 tests passed)
make: *** [nosetests] Error 1
Uploading artifacts...
htmlcov/: found 18 matching files
WARNING: docs/_build/html/: no matching files
nosetests.html: found 1 matching files

nosetests.xml: found 1 matching files

Uploading artifacts to coordinator... ok
id=8075 responseStatus=201 Created token=AF-yp_Wg
ERROR: Job failed: exit code 1